NutzCN Logo
问答 零基础,环境搭建。用MAVEN 启动问题,请大师指导,没用过IDEA,按照文档操作打开项目,不知道怎么运行!!
发布于 219天前 作者 qq_3a90b76f 248 次浏览 复制 上一个帖子 下一个帖子
标签: nutzwk

1/ maven 编译成功

[INFO] ------------------------------------------------------------------------
[INFO] Reactor Summary for NutzWk-NB 5.1.4-SNAPSHOT:
[INFO] [INFO] NutzWk-NB .......................................... SUCCESS [ 3.916 s] [INFO] wk-framework ....................................... SUCCESS [ 5.820 s] [INFO] wk-app ............................................. SUCCESS [ 0.060 s] [INFO] wk-model ........................................... SUCCESS [ 3.726 s] [INFO] wk-common .......................................... SUCCESS [ 4.435 s] [INFO] wk-nb-service-sys .................................. SUCCESS [ 4.571 s] [INFO] wk-nb-service-cms .................................. SUCCESS [ 2.216 s] [INFO] wk-nb-service-wx ................................... SUCCESS [ 2.687 s] [INFO] wk-nb-web-platform ................................. SUCCESS [ 12.020 s] [INFO] wk-nb-web-api ...................................... SUCCESS [ 2.656 s] [INFO] wk-nb-task ......................................... SUCCESS [ 2.434 s] [INFO] wk-nb-web-vue ...................................... SUCCESS [ 10.000 s] [INFO] wk-wiki ............................................ SUCCESS [ 0.059 s] [INFO] ------------------------------------------------------------------------
[INFO] BUILD SUCCESS
[INFO] ------------------------------------------------------------------------
[INFO] Total time: 56.811 s
[INFO] Finished at: 2019-01-16T19:18:25+08:00
[INFO] -------------------------------------------------------------

2 启动失败

[INFO] [INFO] NutzWk-NB .......................................... FAILURE [ 1.447 s] [INFO] wk-framework ....................................... SKIPPED
[INFO] wk-app ............................................. SKIPPED
[INFO] wk-model ........................................... SKIPPED
[INFO] wk-common .......................................... SKIPPED
[INFO] wk-nb-service-sys .................................. SKIPPED
[INFO] wk-nb-service-cms .................................. SKIPPED
[INFO] wk-nb-service-wx ................................... SKIPPED
[INFO] wk-nb-web-platform ................................. SKIPPED
[INFO] wk-nb-web-api ...................................... SKIPPED
[INFO] wk-nb-task ......................................... SKIPPED
[INFO] wk-nb-web-vue ...................................... SKIPPED
[INFO] wk-wiki ............................................ SKIPPED
[INFO] ------------------------------------------------------------------------
[INFO] BUILD FAILURE
[INFO] ------------------------------------------------------------------------
[INFO] Total time: 3.139 s
[INFO] Finished at: 2019-01-16T19:18:45+08:00
[INFO] ------------------------------------------------------------------------
[ERROR] Failed to execute goal org.nutz.boot:nutzboot-maven-plugin:2.3.0-SNAPSHO
T:run (default-cli) on project wk-parent: An exception occured while executing t
he Java class. null: NullPointerException -> [Help 1] [ERROR]
[ERROR] To see the full stack trace of the errors, re-run Maven with the -e swit
ch.
[ERROR] Re-run Maven using the -X switch to enable full debug logging.
[ERROR] [ERROR] For more information about the errors and possible solutions, please rea
d the following articles:
[ERROR] [Help 1] http://cwiki.apache.org/confluence/display/MAVEN/MojoExecutionE
xception

```

3 回复

再把nutzwk的文档看一遍

汗,还是不知道!!!!

添加回复
请先登陆
回到顶部