NutzCN Logo
问答 NutzWk 5 sys maven install异常,好像是ec-common的引入无法获取到导致的
发布于 313天前 作者 qq_3e1f274f 328 次浏览 复制 上一个帖子 下一个帖子
标签: nutzwk
"C:\Program Files\Java\jdk1.8.0_191\bin\java.exe" -Dmaven.multiModuleProjectDirectory=D:\dev\szwork\caikong\wk-app\wk-nb-service-sys -Dmaven.home=D:\dev\maven\apache-maven-3.5.3 -Dclassworlds.conf=D:\dev\maven\apache-maven-3.5.3\bin\m2.conf "-javaagent:E:\workSoftware\IntelliJ IDEA 2018.3.2\lib\idea_rt.jar=62201:E:\workSoftware\IntelliJ IDEA 2018.3.2\bin" -Dfile.encoding=GBK -classpath D:\dev\maven\apache-maven-3.5.3\boot\plexus-classworlds-2.5.2.jar org.codehaus.classworlds.Launcher -Didea.version=2018.3.2 -s D:\dev\maven\apache-maven-3.5.3\conf\settings.xml -Dmaven.repo.local=D:\dev\maven_depot\caikong install
[INFO] Scanning for projects...
Downloading from nutz-snapshots: https://jfrog.nutz.cn/artifactory/snapshots/org/nutz/nutzboot-parent/2.3.8-SNAPSHOT/maven-metadata.xml
Downloaded from nutz-snapshots: https://jfrog.nutz.cn/artifactory/snapshots/org/nutz/nutzboot-parent/2.3.8-SNAPSHOT/maven-metadata.xml (602 B at 1.1 kB/s)
[INFO] 
[INFO] ------------------< cn.wizzer.app:wk-nb-service-sys >-------------------
[INFO] Building wk-nb-service-sys 5.2.7-SNAPSHOT
[INFO] --------------------------------[ jar ]---------------------------------
Downloading from nutz-snapshots: https://jfrog.nutz.cn/artifactory/snapshots/cn/wizzer/wk-framework/5.2.7-SNAPSHOT/maven-metadata.xml
Downloaded from nutz-snapshots: https://jfrog.nutz.cn/artifactory/snapshots/cn/wizzer/wk-framework/5.2.7-SNAPSHOT/maven-metadata.xml (1.2 kB at 9.7 kB/s)
Downloading from nutz-snapshots: https://jfrog.nutz.cn/artifactory/snapshots/cn/wizzer/wk-parent/5.2.7-SNAPSHOT/maven-metadata.xml
Downloaded from nutz-snapshots: https://jfrog.nutz.cn/artifactory/snapshots/cn/wizzer/wk-parent/5.2.7-SNAPSHOT/maven-metadata.xml (595 B at 5.6 kB/s)
Downloading from nutz-snapshots: https://jfrog.nutz.cn/artifactory/snapshots/cn/wizzer/app/wk-model/5.2.7-SNAPSHOT/maven-metadata.xml
Downloaded from nutz-snapshots: https://jfrog.nutz.cn/artifactory/snapshots/cn/wizzer/app/wk-model/5.2.7-SNAPSHOT/maven-metadata.xml (1.2 kB at 13 kB/s)
Downloading from nutz-snapshots: https://jfrog.nutz.cn/artifactory/snapshots/cn/wizzer/app/wk-app/5.2.7-SNAPSHOT/maven-metadata.xml
Downloaded from nutz-snapshots: https://jfrog.nutz.cn/artifactory/snapshots/cn/wizzer/app/wk-app/5.2.7-SNAPSHOT/maven-metadata.xml (596 B at 6.8 kB/s)
Downloading from nutz-snapshots: https://jfrog.nutz.cn/artifactory/snapshots/org/nutz/nutz-integration-json4excel/1.r.68-SNAPSHOT/maven-metadata.xml
Downloaded from nutz-snapshots: https://jfrog.nutz.cn/artifactory/snapshots/org/nutz/nutz-integration-json4excel/1.r.68-SNAPSHOT/maven-metadata.xml (1.2 kB at 13 kB/s)
Downloading from nutz-snapshots: https://jfrog.nutz.cn/artifactory/snapshots/org/nutz/nutzmore/1.r.68-SNAPSHOT/maven-metadata.xml
Downloaded from nutz-snapshots: https://jfrog.nutz.cn/artifactory/snapshots/org/nutz/nutzmore/1.r.68-SNAPSHOT/maven-metadata.xml (597 B at 6.7 kB/s)
Downloading from nutz-snapshots: https://jfrog.nutz.cn/artifactory/snapshots/org/nutz/nutz/1.r.68-SNAPSHOT/maven-metadata.xml
Downloaded from nutz-snapshots: https://jfrog.nutz.cn/artifactory/snapshots/org/nutz/nutz/1.r.68-SNAPSHOT/maven-metadata.xml (1.2 kB at 14 kB/s)
Downloading from nutz-snapshots: https://jfrog.nutz.cn/artifactory/snapshots/cn/wizzer/app/wk-common/5.2.7-SNAPSHOT/maven-metadata.xml
Downloaded from nutz-snapshots: https://jfrog.nutz.cn/artifactory/snapshots/cn/wizzer/app/wk-common/5.2.7-SNAPSHOT/maven-metadata.xml (1.2 kB at 13 kB/s)
Downloading from nutz-snapshots: https://jfrog.nutz.cn/artifactory/snapshots/org/nutz/nutzboot-core/2.3.8-SNAPSHOT/maven-metadata.xml
Downloaded from nutz-snapshots: https://jfrog.nutz.cn/artifactory/snapshots/org/nutz/nutzboot-core/2.3.8-SNAPSHOT/maven-metadata.xml (1.2 kB at 3.5 kB/s)
Downloading from nutz-snapshots: https://jfrog.nutz.cn/artifactory/snapshots/org/nutz/nutzboot-starter-dubbo/2.3.8-SNAPSHOT/maven-metadata.xml
Downloaded from nutz-snapshots: https://jfrog.nutz.cn/artifactory/snapshots/org/nutz/nutzboot-starter-dubbo/2.3.8-SNAPSHOT/maven-metadata.xml (1.2 kB at 16 kB/s)
Downloading from nutz-snapshots: https://jfrog.nutz.cn/artifactory/snapshots/org/nutz/nutzboot-starter/2.3.8-SNAPSHOT/maven-metadata.xml
Downloaded from nutz-snapshots: https://jfrog.nutz.cn/artifactory/snapshots/org/nutz/nutzboot-starter/2.3.8-SNAPSHOT/maven-metadata.xml (603 B at 7.6 kB/s)
Downloading from nutz-snapshots: https://jfrog.nutz.cn/artifactory/snapshots/org/nutz/nutz-integration-dubbo/1.r.68-SNAPSHOT/maven-metadata.xml
Downloaded from nutz-snapshots: https://jfrog.nutz.cn/artifactory/snapshots/org/nutz/nutz-integration-dubbo/1.r.68-SNAPSHOT/maven-metadata.xml (1.2 kB at 14 kB/s)
Downloading from nutz-snapshots: https://jfrog.nutz.cn/artifactory/snapshots/org/nutz/nutzboot-starter-nutz-dao/2.3.8-SNAPSHOT/maven-metadata.xml
Downloaded from nutz-snapshots: https://jfrog.nutz.cn/artifactory/snapshots/org/nutz/nutzboot-starter-nutz-dao/2.3.8-SNAPSHOT/maven-metadata.xml (1.2 kB at 14 kB/s)
Downloading from nutz-snapshots: https://jfrog.nutz.cn/artifactory/snapshots/org/nutz/nutz-plugins-daocache/1.r.68-SNAPSHOT/maven-metadata.xml
Downloaded from nutz-snapshots: https://jfrog.nutz.cn/artifactory/snapshots/org/nutz/nutz-plugins-daocache/1.r.68-SNAPSHOT/maven-metadata.xml (1.2 kB at 15 kB/s)
Downloading from nutz-snapshots: https://jfrog.nutz.cn/artifactory/snapshots/org/nutz/nutzboot-starter-jdbc/2.3.8-SNAPSHOT/maven-metadata.xml
Downloaded from nutz-snapshots: https://jfrog.nutz.cn/artifactory/snapshots/org/nutz/nutzboot-starter-jdbc/2.3.8-SNAPSHOT/maven-metadata.xml (1.2 kB at 8.4 kB/s)
Downloading from nutz-snapshots: https://jfrog.nutz.cn/artifactory/snapshots/org/nutz/nutzboot-starter-redis/2.3.8-SNAPSHOT/maven-metadata.xml
Downloaded from nutz-snapshots: https://jfrog.nutz.cn/artifactory/snapshots/org/nutz/nutzboot-starter-redis/2.3.8-SNAPSHOT/maven-metadata.xml (1.2 kB at 15 kB/s)
Downloading from nutz-snapshots: https://jfrog.nutz.cn/artifactory/snapshots/org/nutz/nutz-integration-jedis/1.r.68-SNAPSHOT/maven-metadata.xml
Downloaded from nutz-snapshots: https://jfrog.nutz.cn/artifactory/snapshots/org/nutz/nutz-integration-jedis/1.r.68-SNAPSHOT/maven-metadata.xml (1.2 kB at 14 kB/s)
Downloading from nutz-snapshots: https://jfrog.nutz.cn/artifactory/snapshots/org/nutz/nutzboot-starter-wkcache/2.3.8-SNAPSHOT/maven-metadata.xml
Downloaded from nutz-snapshots: https://jfrog.nutz.cn/artifactory/snapshots/org/nutz/nutzboot-starter-wkcache/2.3.8-SNAPSHOT/maven-metadata.xml (1.2 kB at 15 kB/s)
Downloading from nutz-snapshots: https://jfrog.nutz.cn/artifactory/snapshots/org/nutz/nutz-plugins-wkcache/1.r.68-SNAPSHOT/maven-metadata.xml
Downloaded from nutz-snapshots: https://jfrog.nutz.cn/artifactory/snapshots/org/nutz/nutz-plugins-wkcache/1.r.68-SNAPSHOT/maven-metadata.xml (1.2 kB at 14 kB/s)
Downloading from nutz-snapshots: https://jfrog.nutz.cn/artifactory/snapshots/org/nutz/nutzboot-starter-sentinel-dubbo/2.3.8-SNAPSHOT/maven-metadata.xml
Downloaded from nutz-snapshots: https://jfrog.nutz.cn/artifactory/snapshots/org/nutz/nutzboot-starter-sentinel-dubbo/2.3.8-SNAPSHOT/maven-metadata.xml (1.2 kB at 16 kB/s)
Downloading from nutz-snapshots: https://jfrog.nutz.cn/artifactory/snapshots/org/nutz/nutzboot-starter-logback-exts/2.3.8-SNAPSHOT/maven-metadata.xml
Downloaded from nutz-snapshots: https://jfrog.nutz.cn/artifactory/snapshots/org/nutz/nutzboot-starter-logback-exts/2.3.8-SNAPSHOT/maven-metadata.xml (1.2 kB at 15 kB/s)
Downloading from nutz-snapshots: https://jfrog.nutz.cn/artifactory/snapshots/org/nutz/nutzboot-starter-test-junit4/2.3.8-SNAPSHOT/maven-metadata.xml
Downloaded from nutz-snapshots: https://jfrog.nutz.cn/artifactory/snapshots/org/nutz/nutzboot-starter-test-junit4/2.3.8-SNAPSHOT/maven-metadata.xml (1.2 kB at 16 kB/s)
[INFO] 
[INFO] --- maven-resources-plugin:2.6:resources (default-resources) @ wk-nb-service-sys ---
[INFO] Using 'UTF-8' encoding to copy filtered resources.
[INFO] Copying 7 resources
[INFO] 
[INFO] --- maven-compiler-plugin:3.7.0:compile (default-compile) @ wk-nb-service-sys ---
[INFO] Compiling 18 source files to D:\dev\szwork\caikong\wk-app\wk-nb-service-sys\target\classes
[INFO] -------------------------------------------------------------
[ERROR] COMPILATION ERROR : 
[INFO] -------------------------------------------------------------
[ERROR] /D:/dev/szwork/caikong/wk-app/wk-nb-service-sys/src/main/java/cn/wizzer/app/sys/modules/services/impl/SysAttServiceImpl.java:[4,42] 找不到符号
  符号:   类 SysAttBusiService
  位置: 程序包 cn.wizzer.app.sys.modules.services
[ERROR] /D:/dev/szwork/caikong/wk-app/wk-nb-service-sys/src/main/java/cn/wizzer/app/sys/modules/services/impl/SysAttServiceImpl.java:[5,42] 找不到符号
  符号:   类 SysAttService
  位置: 程序包 cn.wizzer.app.sys.modules.services
[ERROR] /D:/dev/szwork/caikong/wk-app/wk-nb-service-sys/src/main/java/cn/wizzer/app/sys/modules/services/impl/SysAttServiceImpl.java:[14,76] 找不到符号
  符号: 类 SysAttService
[ERROR] /D:/dev/szwork/caikong/wk-app/wk-nb-service-sys/src/main/java/cn/wizzer/app/sys/modules/services/impl/SysUserServiceImpl.java:[9,22] 程序包cn.wizzer.util不存在
[ERROR] /D:/dev/szwork/caikong/wk-app/wk-nb-service-sys/src/main/java/cn/wizzer/app/sys/modules/services/impl/SysAttBusiServiceImpl.java:[4,42] 找不到符号
  符号:   类 SysAttBusiService
  位置: 程序包 cn.wizzer.app.sys.modules.services
[ERROR] /D:/dev/szwork/caikong/wk-app/wk-nb-service-sys/src/main/java/cn/wizzer/app/sys/modules/services/impl/SysAttBusiServiceImpl.java:[16,85] 找不到符号
  符号: 类 SysAttBusiService
[ERROR] /D:/dev/szwork/caikong/wk-app/wk-nb-service-sys/src/main/java/cn/wizzer/app/sys/modules/services/impl/SysAttServiceImpl.java:[13,27] 找不到符号
  符号: 类 SysAttService
[ERROR] /D:/dev/szwork/caikong/wk-app/wk-nb-service-sys/src/main/java/cn/wizzer/app/sys/modules/services/impl/SysAttBusiServiceImpl.java:[15,27] 找不到符号
  符号: 类 SysAttBusiService
[INFO] 8 errors 
[INFO] -------------------------------------------------------------
[INFO] ------------------------------------------------------------------------
[INFO] BUILD FAILURE
[INFO] ------------------------------------------------------------------------
[INFO] Total time: 7.885 s
[INFO] Finished at: 2020-01-16T10:43:10+08:00
[INFO] ------------------------------------------------------------------------
[ERROR] Failed to execute goal org.apache.maven.plugins:maven-compiler-plugin:3.7.0:compile (default-compile) on project wk-nb-service-sys: Compilation failure: Compilation failure: 
[ERROR] /D:/dev/szwork/caikong/wk-app/wk-nb-service-sys/src/main/java/cn/wizzer/app/sys/modules/services/impl/SysAttServiceImpl.java:[4,42] 找不到符号
[ERROR]   符号:   类 SysAttBusiService
[ERROR]   位置: 程序包 cn.wizzer.app.sys.modules.services
[ERROR] /D:/dev/szwork/caikong/wk-app/wk-nb-service-sys/src/main/java/cn/wizzer/app/sys/modules/services/impl/SysAttServiceImpl.java:[5,42] 找不到符号
[ERROR]   符号:   类 SysAttService
[ERROR]   位置: 程序包 cn.wizzer.app.sys.modules.services
[ERROR] /D:/dev/szwork/caikong/wk-app/wk-nb-service-sys/src/main/java/cn/wizzer/app/sys/modules/services/impl/SysAttServiceImpl.java:[14,76] 找不到符号
[ERROR]   符号: 类 SysAttService
[ERROR] /D:/dev/szwork/caikong/wk-app/wk-nb-service-sys/src/main/java/cn/wizzer/app/sys/modules/services/impl/SysUserServiceImpl.java:[9,22] 程序包cn.wizzer.util不存在
[ERROR] /D:/dev/szwork/caikong/wk-app/wk-nb-service-sys/src/main/java/cn/wizzer/app/sys/modules/services/impl/SysAttBusiServiceImpl.java:[4,42] 找不到符号
[ERROR]   符号:   类 SysAttBusiService
[ERROR]   位置: 程序包 cn.wizzer.app.sys.modules.services
[ERROR] /D:/dev/szwork/caikong/wk-app/wk-nb-service-sys/src/main/java/cn/wizzer/app/sys/modules/services/impl/SysAttBusiServiceImpl.java:[16,85] 找不到符号
[ERROR]   符号: 类 SysAttBusiService
[ERROR] /D:/dev/szwork/caikong/wk-app/wk-nb-service-sys/src/main/java/cn/wizzer/app/sys/modules/services/impl/SysAttServiceImpl.java:[13,27] 找不到符号
[ERROR]   符号: 类 SysAttService
[ERROR] /D:/dev/szwork/caikong/wk-app/wk-nb-service-sys/src/main/java/cn/wizzer/app/sys/modules/services/impl/SysAttBusiServiceImpl.java:[15,27] 找不到符号
[ERROR]   符号: 类 SysAttBusiService
[ERROR] -> [Help 1]
[ERROR] 
[ERROR] To see the full stack trace of the errors, re-run Maven with the -e switch.
[ERROR] Re-run Maven using the -X switch to enable full debug logging.
[ERROR] 
[ERROR] For more information about the errors and possible solutions, please read the following articles:
[ERROR] [Help 1] http://cwiki.apache.org/confluence/display/MAVEN/MojoFailureException

Process finished with exit code 1

2 回复

先在根目录mvn install

嗯,已解决。

添加回复
请先登陆
回到顶部