NutzCN Logo
问答 仓库是不是有异常,这个包一直下不来,我浏览器http进入可以看到,https
发布于 256天前 作者 shufu 438 次浏览 复制 上一个帖子 下一个帖子
标签:
[WARNING] org.nutz:nutzboot-starter-ftp:2.4.3-SNAPSHOT/maven-metadata.xmlfailed to transfer from https://jfrog.nutz.cn/artifactory/libs-release during a previous attempt. This failure was cached in the local repository and resolution will not be reattempted until the update interval of nutz has elapsed or updates are forced. Original error: Could not transfer metadata org.nutz:nutzboot-starter-ftp:2.4.3-SNAPSHOT/maven-metadata.xml from/to nutz (https://jfrog.nutz.cn/artifactory/libs-release): transfer failed for https://jfrog.nutz.cn/artifactory/libs-release/org/nutz/nutzboot-starter-ftp/2.4.3-SNAPSHOT/maven-metadata.xml
[WARNING] org.nutz:nutzboot-starter-ftp:2.4.3-SNAPSHOT/maven-metadata.xmlfailed to transfer from https://jfrog.nutz.cn/artifactory/snapshots during a previous attempt. This failure was cached in the local repository and resolution will not be reattempted until the update interval of nutz-snapshots has elapsed or updates are forced. Original error: Could not transfer metadata org.nutz:nutzboot-starter-ftp:2.4.3-SNAPSHOT/maven-metadata.xml from/to nutz-snapshots (https://jfrog.nutz.cn/artifactory/snapshots): transfer failed for https://jfrog.nutz.cn/artifactory/snapshots/org/nutz/nutzboot-starter-ftp/2.4.3-SNAPSHOT/maven-metadata.xml
Downloading from nutz: https://jfrog.nutz.cn/artifactory/libs-release/org/nutz/nutzboot-starter-ftp/2.4.3-SNAPSHOT/nutzboot-starter-ftp-2.4.3-SNAPSHOT.pom
Downloading from nutz-snapshots: https://jfrog.nutz.cn/artifactory/snapshots/org/nutz/nutzboot-starter-ftp/2.4.3-SNAPSHOT/nutzboot-starter-ftp-2.4.3-SNAPSHOT.pom
[INFO] ------------------------------------------------------------------------
[INFO] BUILD FAILURE
[INFO] ------------------------------------------------------------------------
[INFO] Total time:  1.909 s
[INFO] Finished at: 2021-11-30T15:41:07+08:00
[INFO] ------------------------------------------------------------------------
[ERROR] Failed to execute goal on project epei-starter-storage: Could not resolve dependencies for project shu.epei.xin:epei-starter-storage:jar:2.0.0: Failed to collect dependencies at org.nutz:nutzboot-starter-ftp:jar:2.4.3-SNAPSHOT: Failed to read artifact descriptor for org.nutz:nutzboot-starter-ftp:jar:2.4.3-SNAPSHOT: Could not transfer artifact org.nutz:nutzboot-starter-ftp:pom:2.4.3-SNAPSHOT from/to nutz (https://jfrog.nutz.cn/artifactory/libs-release): transfer failed for https://jfrog.nutz.cn/artifactory/libs-release/org/nutz/nutzboot-starter-ftp/2.4.3-SNAPSHOT/nutzboot-starter-ftp-2.4.3-SNAPSHOT.pom: sun.security.validator.ValidatorException: PKIX path validation failed: java.security.cert.CertPathValidatorException: validity check failed: NotAfter: Mon Nov 29 11:04:30 CST 2021 -> [Help 1]
[ERROR] 
[ERROR] To see the full stack trace of the errors, re-run Maven with the -e switch.
[ERROR] Re-run Maven using the -X switch to enable full debug logging.
[ERROR] 
[ERROR] For more information about the errors and possible solutions, please read the following articles:
[ERROR] [Help 1] http://cwiki.apache.org/confluence/display/MAVEN/DependencyResolutionException
2 回复

这个帖子是误发,请删除

添加回复
请先登陆
回到顶部